Build failed in Jenkins: Log4jWindows » Windows,JDK 1.7 (unlimited security) 64-bit Windows only #62

classic Classic list List threaded Threaded
2 messages Options
Reply | Threaded
Open this post in threaded view
|  
Report Content as Inappropriate

Build failed in Jenkins: Log4jWindows » Windows,JDK 1.7 (unlimited security) 64-bit Windows only #62

Apache Jenkins Server
See <https://builds.apache.org/job/Log4jWindows/Windows%20Slaves=Windows,jdk=JDK%201.7%20(unlimited%20security)%2064-bit%20Windows%20only/62/display/redirect?page=changes>

Changes:

[mikael.staldal] LOG4J2-1867 Fix configuration documentation

------------------------------------------
[...truncated 373.48 KB...]
2017-04-11 16:48:39,767 main DEBUG Building Plugin[name=appender, class=org.apache.logging.log4j.core.appender.FileAppender].
2017-04-11 16:48:39,776 main DEBUG FileAppender$Builder(fileName="target/test-properties.log", append="null", locking="null", advertise="null", advertiseUri="null", createOnDemand="null", bufferedIo="false", bufferSize="null", immediateFlush="null", ignoreExceptions="null", PatternLayout(%d %p %C{1.} [%t] %m%n), name="File", Configuration(PropertiesConfigTest), Filter=null)
2017-04-11 16:48:39,776 main WARN The bufferSize is set to 8192 but bufferedIo is false: false
2017-04-11 16:48:39,781 main DEBUG Starting FileManager target/test-properties.log
2017-04-11 16:48:39,781 main DEBUG Building Plugin[name=filter, class=org.apache.logging.log4j.core.filter.ThresholdFilter].
2017-04-11 16:48:39,783 main DEBUG createFilter(level="ERROR", onMatch="null", onMismatch="null")
2017-04-11 16:48:39,784 main DEBUG Building Plugin[name=appender, class=org.apache.logging.log4j.test.appender.ListAppender].
2017-04-11 16:48:39,787 main DEBUG ListAppender$Builder(name="List", entryPerNewLine="null", raw="null", Layout=null, ThresholdFilter(ERROR))
2017-04-11 16:48:39,787 main DEBUG Building Plugin[name=layout, class=org.apache.logging.log4j.core.layout.PatternLayout].
2017-04-11 16:48:39,789 main DEBUG PatternLayout$Builder(pattern="%m%n", PatternSelector=null, Configuration(PropertiesConfigTest), Replace=null, charset="null", alwaysWriteExceptions="null", disableAnsi="null", noConsoleNoAnsi="null", header="null", footer="null")
2017-04-11 16:48:39,790 main DEBUG Building Plugin[name=appender, class=org.apache.logging.log4j.core.appender.ConsoleAppender].
2017-04-11 16:48:39,793 main DEBUG ConsoleAppender$Builder(target="null", follow="null", direct="null", bufferedIo="null", bufferSize="null", immediateFlush="null", ignoreExceptions="null", PatternLayout(%m%n), name="STDOUT", Configuration(PropertiesConfigTest), Filter=null)
2017-04-11 16:48:39,793 main WARN Unable to instantiate org.fusesource.jansi.WindowsAnsiOutputStream
2017-04-11 16:48:39,794 main DEBUG Starting OutputStreamManager SYSTEM_OUT.false.false
2017-04-11 16:48:39,794 main DEBUG Building Plugin[name=appenders, class=org.apache.logging.log4j.core.config.AppendersPlugin].
2017-04-11 16:48:39,795 main DEBUG createAppenders(={File, List, STDOUT})
2017-04-11 16:48:39,795 main DEBUG Building Plugin[name=filter, class=org.apache.logging.log4j.core.filter.ThresholdFilter].
2017-04-11 16:48:39,796 main DEBUG createFilter(level="DEBUG", onMatch="null", onMismatch="null")
2017-04-11 16:48:39,798 main DEBUG Configuration org.apache.logging.log4j.core.config.properties.PropertiesConfiguration@7ac01ae4 initialized
2017-04-11 16:48:39,798 main DEBUG Starting configuration org.apache.logging.log4j.core.config.properties.PropertiesConfiguration@7ac01ae4
2017-04-11 16:48:39,799 main DEBUG Log4j2 ConfigurationScheduler starting 1 threads
2017-04-11 16:48:39,800 main DEBUG Started configuration org.apache.logging.log4j.core.config.properties.PropertiesConfiguration@7ac01ae4 OK.
2017-04-11 16:48:39,801 main DEBUG Shutting down OutputStreamManager SYSTEM_OUT.false.false-1
2017-04-11 16:48:39,802 main DEBUG Shut down OutputStreamManager SYSTEM_OUT.false.false-1, all resources released: true
2017-04-11 16:48:39,802 main DEBUG Appender DefaultConsole-1 stopped with status true
2017-04-11 16:48:39,802 main DEBUG Stopped org.apache.logging.log4j.core.config.DefaultConfiguration@52052438 OK
2017-04-11 16:48:39,913 main DEBUG Registering MBean org.apache.logging.log4j2:type=org.apache.logging.log4j.core.PropertiesFileConfigTest
2017-04-11 16:48:39,918 main DEBUG Registering MBean org.apache.logging.log4j2:type=org.apache.logging.log4j.core.PropertiesFileConfigTest,component=StatusLogger
2017-04-11 16:48:39,920 main DEBUG Registering MBean org.apache.logging.log4j2:type=org.apache.logging.log4j.core.PropertiesFileConfigTest,component=ContextSelector
2017-04-11 16:48:39,924 main DEBUG Registering MBean org.apache.logging.log4j2:type=org.apache.logging.log4j.core.PropertiesFileConfigTest,component=Loggers,name=org.apache.logging.log4j.test2
2017-04-11 16:48:39,924 main DEBUG Registering MBean org.apache.logging.log4j2:type=org.apache.logging.log4j.core.PropertiesFileConfigTest,component=Loggers,name=
2017-04-11 16:48:39,925 main DEBUG Registering MBean org.apache.logging.log4j2:type=org.apache.logging.log4j.core.PropertiesFileConfigTest,component=Loggers,name=org.apache.logging.log4j.test1
2017-04-11 16:48:39,927 main DEBUG Registering MBean org.apache.logging.log4j2:type=org.apache.logging.log4j.core.PropertiesFileConfigTest,component=Appenders,name=List
2017-04-11 16:48:39,928 main DEBUG Registering MBean org.apache.logging.log4j2:type=org.apache.logging.log4j.core.PropertiesFileConfigTest,component=Appenders,name=STDOUT
2017-04-11 16:48:39,928 main DEBUG Registering MBean org.apache.logging.log4j2:type=org.apache.logging.log4j.core.PropertiesFileConfigTest,component=Appenders,name=File
2017-04-11 16:48:39,931 main DEBUG LoggerContext[name=org.apache.logging.log4j.core.PropertiesFileConfigTest, org.apache.logging.log4j.core.LoggerContext@12339dd9] started OK with configuration org.apache.logging.log4j.core.config.properties.PropertiesConfiguration@7ac01ae4.
Running org.apache.logging.log4j.core.PropertiesFileConfigTest
2017-04-11 16:48:40,801 Log4j2-TF-2-Scheduled-1 INFO File target\test-classes\log4j-test2.properties was modified on 1491928474426, previous modification was 1491928464426
2017-04-11 16:48:40,804 Log4j2-TF-1-ConfiguratonFileWatcher-2 DEBUG Reconfiguration started for context org.apache.logging.log4j.core.PropertiesFileConfigTest (org.apache.logging.log4j.core.LoggerContext@12339dd9)
2017-04-11 16:48:40,805 Log4j2-TF-1-ConfiguratonFileWatcher-2 DEBUG Not in a ServletContext environment, thus not loading WebLookup plugin.
2017-04-11 16:48:40,809 Log4j2-TF-1-ConfiguratonFileWatcher-2 DEBUG Not in a ServletContext environment, thus not loading WebLookup plugin.
2017-04-11 16:48:40,809 Log4j2-TF-1-ConfiguratonFileWatcher-2 DEBUG Initializing configuration org.apache.logging.log4j.core.config.properties.PropertiesConfiguration@6e9637fe
2017-04-11 16:48:40,811 Log4j2-TF-1-ConfiguratonFileWatcher-2 DEBUG Installed script engines
2017-04-11 16:48:40,812 Log4j2-TF-1-ConfiguratonFileWatcher-2 DEBUG Groovy Scripting Engine Version: 2.0, Language: Groovy, Threading: MULTITHREADED, Compile: true, Names: {groovy, Groovy}
2017-04-11 16:48:40,813 Log4j2-TF-1-ConfiguratonFileWatcher-2 DEBUG Mozilla Rhino Version: 1.7 release 3 PRERELEASE, Language: ECMAScript, Threading: MULTITHREADED, Compile: true, Names: {js, rhino, JavaScript, javascript, ECMAScript, ecmascript}
2017-04-11 16:48:40,826 Log4j2-TF-1-ConfiguratonFileWatcher-2 DEBUG BeanShell Engine Version: 1.0, Language: BeanShell, Threading: MULTITHREADED, Compile: true, Names: {beanshell, bsh, java}
2017-04-11 16:48:40,827 Log4j2-TF-1-ConfiguratonFileWatcher-2 DEBUG PluginManager 'Core' found 122 plugins
2017-04-11 16:48:40,827 Log4j2-TF-1-ConfiguratonFileWatcher-2 DEBUG PluginManager 'Level' found 1 plugins
2017-04-11 16:48:40,828 Log4j2-TF-1-ConfiguratonFileWatcher-2 DEBUG Building Plugin[name=property, class=org.apache.logging.log4j.core.config.Property].
2017-04-11 16:48:40,828 Log4j2-TF-1-ConfiguratonFileWatcher-2 DEBUG createProperty(name="filename", value="target/test-properties.log")
2017-04-11 16:48:40,829 Log4j2-TF-1-ConfiguratonFileWatcher-2 DEBUG Building Plugin[name=properties, class=org.apache.logging.log4j.core.config.PropertiesPlugin].
2017-04-11 16:48:40,829 Log4j2-TF-1-ConfiguratonFileWatcher-2 DEBUG configureSubstitutor(={filename=target/test-properties.log}, Configuration(PropertiesConfigTest))
2017-04-11 16:48:40,830 Log4j2-TF-1-ConfiguratonFileWatcher-2 DEBUG PluginManager 'Lookup' found 13 plugins
2017-04-11 16:48:40,830 Log4j2-TF-1-ConfiguratonFileWatcher-2 DEBUG Building Plugin[name=AppenderRef, class=org.apache.logging.log4j.core.config.AppenderRef].
2017-04-11 16:48:40,831 Log4j2-TF-1-ConfiguratonFileWatcher-2 DEBUG createAppenderRef(ref="File", level="null", Filter=null)
2017-04-11 16:48:40,831 Log4j2-TF-1-ConfiguratonFileWatcher-2 DEBUG Building Plugin[name=logger, class=org.apache.logging.log4j.core.config.LoggerConfig].
2017-04-11 16:48:40,833 Log4j2-TF-1-ConfiguratonFileWatcher-2 DEBUG createLogger(additivity="false", level="DEBUG", name="org.apache.logging.log4j.test2", includeLocation="null", ={File}, ={}, Configuration(PropertiesConfigTest), Filter=null)
2017-04-11 16:48:40,833 Log4j2-TF-1-ConfiguratonFileWatcher-2 DEBUG Building Plugin[name=AppenderRef, class=org.apache.logging.log4j.core.config.AppenderRef].
2017-04-11 16:48:40,834 Log4j2-TF-1-ConfiguratonFileWatcher-2 DEBUG createAppenderRef(ref="STDOUT", level="null", Filter=null)
2017-04-11 16:48:40,834 Log4j2-TF-1-ConfiguratonFileWatcher-2 DEBUG Building Plugin[name=KeyValuePair, class=org.apache.logging.log4j.core.util.KeyValuePair].
2017-04-11 16:48:40,835 Log4j2-TF-1-ConfiguratonFileWatcher-2 DEBUG KeyValuePair$Builder(key="test", value="123")
2017-04-11 16:48:40,835 Log4j2-TF-1-ConfiguratonFileWatcher-2 DEBUG Building Plugin[name=filter, class=org.apache.logging.log4j.core.filter.ThreadContextMapFilter].
2017-04-11 16:48:40,836 Log4j2-TF-1-ConfiguratonFileWatcher-2 DEBUG createFilter(={test=123}, operator="null", onMatch="null", onMismatch="null")
2017-04-11 16:48:40,836 Log4j2-TF-1-ConfiguratonFileWatcher-2 DEBUG Building Plugin[name=logger, class=org.apache.logging.log4j.core.config.LoggerConfig].
2017-04-11 16:48:40,839 Log4j2-TF-1-ConfiguratonFileWatcher-2 DEBUG createLogger(additivity="false", level="DEBUG", name="org.apache.logging.log4j.test1", includeLocation="null", ={STDOUT}, ={}, Configuration(PropertiesConfigTest), ThreadContextMapFilter(isAnd=true, {test=[123]}))
2017-04-11 16:48:40,839 Log4j2-TF-1-ConfiguratonFileWatcher-2 DEBUG Building Plugin[name=AppenderRef, class=org.apache.logging.log4j.core.config.AppenderRef].
2017-04-11 16:48:40,840 Log4j2-TF-1-ConfiguratonFileWatcher-2 DEBUG createAppenderRef(ref="STDOUT", level="null", Filter=null)
2017-04-11 16:48:40,840 Log4j2-TF-1-ConfiguratonFileWatcher-2 DEBUG Building Plugin[name=root, class=org.apache.logging.log4j.core.config.LoggerConfig$RootLogger].
2017-04-11 16:48:40,841 Log4j2-TF-1-ConfiguratonFileWatcher-2 DEBUG createLogger(additivity="null", level="ERROR", includeLocation="null", ={STDOUT}, ={}, Configuration(PropertiesConfigTest), Filter=null)
2017-04-11 16:48:40,842 Log4j2-TF-1-ConfiguratonFileWatcher-2 DEBUG Building Plugin[name=loggers, class=org.apache.logging.log4j.core.config.LoggersPlugin].
2017-04-11 16:48:40,842 Log4j2-TF-1-ConfiguratonFileWatcher-2 DEBUG createLoggers(={org.apache.logging.log4j.test2, org.apache.logging.log4j.test1, root})
2017-04-11 16:48:40,842 Log4j2-TF-1-ConfiguratonFileWatcher-2 DEBUG Building Plugin[name=layout, class=org.apache.logging.log4j.core.layout.PatternLayout].
2017-04-11 16:48:40,844 Log4j2-TF-1-ConfiguratonFileWatcher-2 DEBUG PatternLayout$Builder(pattern="%d %p %C{1.} [%t] %m%n", PatternSelector=null, Configuration(PropertiesConfigTest), Replace=null, charset="null", alwaysWriteExceptions="null", disableAnsi="null", noConsoleNoAnsi="null", header="null", footer="null")
2017-04-11 16:48:40,845 Log4j2-TF-1-ConfiguratonFileWatcher-2 DEBUG PluginManager 'Converter' found 41 plugins
2017-04-11 16:48:40,846 Log4j2-TF-1-ConfiguratonFileWatcher-2 DEBUG Building Plugin[name=appender, class=org.apache.logging.log4j.core.appender.FileAppender].
2017-04-11 16:48:40,848 Log4j2-TF-1-ConfiguratonFileWatcher-2 DEBUG FileAppender$Builder(fileName="target/test-properties.log", append="null", locking="null", advertise="null", advertiseUri="null", createOnDemand="null", bufferedIo="false", bufferSize="null", immediateFlush="null", ignoreExceptions="null", PatternLayout(%d %p %C{1.} [%t] %m%n), name="File", Configuration(PropertiesConfigTest), Filter=null)
2017-04-11 16:48:40,848 Log4j2-TF-1-ConfiguratonFileWatcher-2 WARN The bufferSize is set to 8192 but bufferedIo is false: false
2017-04-11 16:48:40,849 Log4j2-TF-1-ConfiguratonFileWatcher-2 DEBUG Building Plugin[name=filter, class=org.apache.logging.log4j.core.filter.ThresholdFilter].
2017-04-11 16:48:40,850 Log4j2-TF-1-ConfiguratonFileWatcher-2 DEBUG createFilter(level="ERROR", onMatch="null", onMismatch="null")
2017-04-11 16:48:40,850 Log4j2-TF-1-ConfiguratonFileWatcher-2 DEBUG Building Plugin[name=appender, class=org.apache.logging.log4j.test.appender.ListAppender].
2017-04-11 16:48:40,851 Log4j2-TF-1-ConfiguratonFileWatcher-2 DEBUG ListAppender$Builder(name="List", entryPerNewLine="null", raw="null", Layout=null, ThresholdFilter(ERROR))
2017-04-11 16:48:40,851 Log4j2-TF-1-ConfiguratonFileWatcher-2 DEBUG Building Plugin[name=layout, class=org.apache.logging.log4j.core.layout.PatternLayout].
2017-04-11 16:48:40,853 Log4j2-TF-1-ConfiguratonFileWatcher-2 DEBUG PatternLayout$Builder(pattern="%m%n", PatternSelector=null, Configuration(PropertiesConfigTest), Replace=null, charset="null", alwaysWriteExceptions="null", disableAnsi="null", noConsoleNoAnsi="null", header="null", footer="null")
2017-04-11 16:48:40,853 Log4j2-TF-1-ConfiguratonFileWatcher-2 DEBUG Building Plugin[name=appender, class=org.apache.logging.log4j.core.appender.ConsoleAppender].
2017-04-11 16:48:40,856 Log4j2-TF-1-ConfiguratonFileWatcher-2 DEBUG ConsoleAppender$Builder(target="null", follow="null", direct="null", bufferedIo="null", bufferSize="null", immediateFlush="null", ignoreExceptions="null", PatternLayout(%m%n), name="STDOUT", Configuration(PropertiesConfigTest), Filter=null)
2017-04-11 16:48:40,856 Log4j2-TF-1-ConfiguratonFileWatcher-2 WARN Unable to instantiate org.fusesource.jansi.WindowsAnsiOutputStream
2017-04-11 16:48:40,857 Log4j2-TF-1-ConfiguratonFileWatcher-2 DEBUG Building Plugin[name=appenders, class=org.apache.logging.log4j.core.config.AppendersPlugin].
2017-04-11 16:48:40,857 Log4j2-TF-1-ConfiguratonFileWatcher-2 DEBUG createAppenders(={File, List, STDOUT})
2017-04-11 16:48:40,857 Log4j2-TF-1-ConfiguratonFileWatcher-2 DEBUG Building Plugin[name=filter, class=org.apache.logging.log4j.core.filter.ThresholdFilter].
2017-04-11 16:48:40,858 Log4j2-TF-1-ConfiguratonFileWatcher-2 DEBUG createFilter(level="DEBUG", onMatch="null", onMismatch="null")
2017-04-11 16:48:40,858 Log4j2-TF-1-ConfiguratonFileWatcher-2 DEBUG Configuration org.apache.logging.log4j.core.config.properties.PropertiesConfiguration@6e9637fe initialized
2017-04-11 16:48:40,859 Log4j2-TF-1-ConfiguratonFileWatcher-2 DEBUG Starting configuration org.apache.logging.log4j.core.config.properties.PropertiesConfiguration@6e9637fe
2017-04-11 16:48:40,859 Log4j2-TF-1-ConfiguratonFileWatcher-2 DEBUG Log4j2 ConfigurationScheduler starting 1 threads
2017-04-11 16:48:40,859 Log4j2-TF-1-ConfiguratonFileWatcher-2 DEBUG Started configuration org.apache.logging.log4j.core.config.properties.PropertiesConfiguration@6e9637fe OK.
2017-04-11 16:48:40,860 Log4j2-TF-1-ConfiguratonFileWatcher-2 DEBUG Appender File stopped with status true
2017-04-11 16:48:40,860 Log4j2-TF-1-ConfiguratonFileWatcher-2 DEBUG Appender STDOUT stopped with status true
2017-04-11 16:48:40,861 Log4j2-TF-1-ConfiguratonFileWatcher-2 DEBUG Log4j2 ConfigurationScheduler shutting down threads in java.util.concurrent.ScheduledThreadPoolExecutor@2e5d4162[Running, pool size = 1, active threads = 0, queued tasks = 1, completed tasks = 1]
2017-04-11 16:48:40,861 Log4j2-TF-1-ConfiguratonFileWatcher-2 DEBUG Stopped org.apache.logging.log4j.core.config.properties.PropertiesConfiguration@7ac01ae4 OK
2017-04-11 16:48:40,863 Log4j2-TF-1-ConfiguratonFileWatcher-2 DEBUG Registering MBean org.apache.logging.log4j2:type=org.apache.logging.log4j.core.PropertiesFileConfigTest
2017-04-11 16:48:40,864 Log4j2-TF-1-ConfiguratonFileWatcher-2 DEBUG Registering MBean org.apache.logging.log4j2:type=org.apache.logging.log4j.core.PropertiesFileConfigTest,component=StatusLogger
2017-04-11 16:48:40,864 Log4j2-TF-1-ConfiguratonFileWatcher-2 DEBUG Registering MBean org.apache.logging.log4j2:type=org.apache.logging.log4j.core.PropertiesFileConfigTest,component=ContextSelector
2017-04-11 16:48:40,865 Log4j2-TF-1-ConfiguratonFileWatcher-2 DEBUG Registering MBean org.apache.logging.log4j2:type=org.apache.logging.log4j.core.PropertiesFileConfigTest,component=Loggers,name=org.apache.logging.log4j.test2
2017-04-11 16:48:40,865 Log4j2-TF-1-ConfiguratonFileWatcher-2 DEBUG Registering MBean org.apache.logging.log4j2:type=org.apache.logging.log4j.core.PropertiesFileConfigTest,component=Loggers,name=
2017-04-11 16:48:40,865 Log4j2-TF-1-ConfiguratonFileWatcher-2 DEBUG Registering MBean org.apache.logging.log4j2:type=org.apache.logging.log4j.core.PropertiesFileConfigTest,component=Loggers,name=org.apache.logging.log4j.test1
2017-04-11 16:48:40,866 Log4j2-TF-1-ConfiguratonFileWatcher-2 DEBUG Registering MBean org.apache.logging.log4j2:type=org.apache.logging.log4j.core.PropertiesFileConfigTest,component=Appenders,name=List
2017-04-11 16:48:40,866 Log4j2-TF-1-ConfiguratonFileWatcher-2 DEBUG Registering MBean org.apache.logging.log4j2:type=org.apache.logging.log4j.core.PropertiesFileConfigTest,component=Appenders,name=STDOUT
2017-04-11 16:48:40,867 Log4j2-TF-1-ConfiguratonFileWatcher-2 DEBUG Registering MBean org.apache.logging.log4j2:type=org.apache.logging.log4j.core.PropertiesFileConfigTest,component=Appenders,name=File
2017-04-11 16:48:40,867 Log4j2-TF-1-ConfiguratonFileWatcher-2 DEBUG Reconfiguration completed for org.apache.logging.log4j.core.PropertiesFileConfigTest (org.apache.logging.log4j.core.LoggerContext@12339dd9)
2017-04-11 16:48:46,041 main DEBUG Stopping LoggerContext[name=org.apache.logging.log4j.core.PropertiesFileConfigTest, org.apache.logging.log4j.core.LoggerContext@12339dd9]...
2017-04-11 16:48:46,044 main DEBUG Shutting down FileManager target/test-properties.log
2017-04-11 16:48:46,044 main DEBUG Shut down FileManager target/test-properties.log, all resources released: true
2017-04-11 16:48:46,044 main DEBUG Appender File stopped with status true
2017-04-11 16:48:46,045 main DEBUG Shutting down OutputStreamManager SYSTEM_OUT.false.false
2017-04-11 16:48:46,045 main DEBUG Shut down OutputStreamManager SYSTEM_OUT.false.false, all resources released: true
2017-04-11 16:48:46,045 main DEBUG Appender STDOUT stopped with status true
2017-04-11 16:48:46,046 main DEBUG Log4j2 ConfigurationScheduler shutting down threads in java.util.concurrent.ScheduledThreadPoolExecutor@3e3953e8[Running, pool size = 1, active threads = 0, queued tasks = 1, completed tasks = 5]
2017-04-11 16:48:46,046 main DEBUG Stopped org.apache.logging.log4j.core.config.properties.PropertiesConfiguration@6e9637fe OK
2017-04-11 16:48:46,047 main DEBUG Stopped LoggerContext[name=org.apache.logging.log4j.core.PropertiesFileConfigTest, org.apache.logging.log4j.core.LoggerContext@12339dd9] with status true
Tests run: 1, Failures: 0, Errors: 0, Skipped: 0, Time elapsed: 6.106 sec - in org.apache.logging.log4j.core.PropertiesFileConfigTest
Running org.apache.logging.log4j.core.selector.ClassLoaderContextSelectorTest
ERROR StatusLogger No log4j2 configuration file found. Using default configuration: logging only errors to the console. Set system property 'org.apache.logging.log4j.simplelog.StatusLogger.level' to TRACE to show Log4j2 internal initialization logging.
Tests run: 1, Failures: 0, Errors: 0, Skipped: 0, Time elapsed: 0.952 sec - in org.apache.logging.log4j.core.selector.ClassLoaderContextSelectorTest
Running org.apache.logging.log4j.core.ShutdownDisabledTest
Tests run: 1, Failures: 0, Errors: 0, Skipped: 0, Time elapsed: 0.011 sec - in org.apache.logging.log4j.core.ShutdownDisabledTest
Running org.apache.logging.log4j.core.ShutdownTimeoutConfigurationTest
Tests run: 1, Failures: 0, Errors: 0, Skipped: 0, Time elapsed: 0.005 sec - in org.apache.logging.log4j.core.ShutdownTimeoutConfigurationTest
Running org.apache.logging.log4j.core.StrictXmlConfigTest
Tests run: 10, Failures: 0, Errors: 0, Skipped: 0, Time elapsed: 0.073 sec - in org.apache.logging.log4j.core.StrictXmlConfigTest
Running org.apache.logging.log4j.core.TimestampMessageTest
Tests run: 1, Failures: 0, Errors: 0, Skipped: 0, Time elapsed: 0.042 sec - in org.apache.logging.log4j.core.TimestampMessageTest
Running org.apache.logging.log4j.core.tools.GenerateCustomLoggerTest
Tests run: 1, Failures: 0, Errors: 0, Skipped: 0, Time elapsed: 1.93 sec - in org.apache.logging.log4j.core.tools.GenerateCustomLoggerTest
Running org.apache.logging.log4j.core.tools.GenerateExtendedLoggerTest
Tests run: 1, Failures: 0, Errors: 0, Skipped: 0, Time elapsed: 2.048 sec - in org.apache.logging.log4j.core.tools.GenerateExtendedLoggerTest
Running org.apache.logging.log4j.core.util.AssertTest
Tests run: 13, Failures: 0, Errors: 0, Skipped: 0, Time elapsed: 0 sec - in org.apache.logging.log4j.core.util.AssertTest
Running org.apache.logging.log4j.core.util.ClockFactoryTest
Tests run: 8, Failures: 0, Errors: 0, Skipped: 0, Time elapsed: 0.172 sec - in org.apache.logging.log4j.core.util.ClockFactoryTest
Running org.apache.logging.log4j.core.util.CronExpressionTest
Tests run: 12, Failures: 0, Errors: 0, Skipped: 0, Time elapsed: 0.687 sec - in org.apache.logging.log4j.core.util.CronExpressionTest
Running org.apache.logging.log4j.core.util.datetime.FastDateParserSDFTest
Tests run: 276, Failures: 0, Errors: 0, Skipped: 0, Time elapsed: 0.232 sec - in org.apache.logging.log4j.core.util.datetime.FastDateParserSDFTest
Running org.apache.logging.log4j.core.util.datetime.FastDateParserTest
Tests run: 37, Failures: 0, Errors: 0, Skipped: 0, Time elapsed: 2.122 sec - in org.apache.logging.log4j.core.util.datetime.FastDateParserTest
Running org.apache.logging.log4j.core.util.datetime.FastDateParser_MoreOrLessTest
Tests run: 7, Failures: 0, Errors: 0, Skipped: 0, Time elapsed: 0.127 sec - in org.apache.logging.log4j.core.util.datetime.FastDateParser_MoreOrLessTest
Running org.apache.logging.log4j.core.util.datetime.FastDateParser_TimeZoneStrategyTest
Tests run: 2, Failures: 0, Errors: 0, Skipped: 0, Time elapsed: 3.875 sec - in org.apache.logging.log4j.core.util.datetime.FastDateParser_TimeZoneStrategyTest
Running org.apache.logging.log4j.core.util.datetime.FixedDateFormatTest
Tests run: 25, Failures: 0, Errors: 0, Skipped: 0, Time elapsed: 1.752 sec - in org.apache.logging.log4j.core.util.datetime.FixedDateFormatTest
Running org.apache.logging.log4j.core.util.DummyNanoClockTest
Tests run: 2, Failures: 0, Errors: 0, Skipped: 0, Time elapsed: 0.005 sec - in org.apache.logging.log4j.core.util.DummyNanoClockTest
Running org.apache.logging.log4j.core.util.FileUtilsTest
Tests run: 4, Failures: 0, Errors: 0, Skipped: 0, Time elapsed: 0.048 sec - in org.apache.logging.log4j.core.util.FileUtilsTest
Running org.apache.logging.log4j.core.util.IntegersTest
Tests run: 2, Failures: 0, Errors: 0, Skipped: 0, Time elapsed: 0 sec - in org.apache.logging.log4j.core.util.IntegersTest
Running org.apache.logging.log4j.core.util.JsonUtilsTest
Tests run: 3, Failures: 0, Errors: 0, Skipped: 0, Time elapsed: 0.004 sec - in org.apache.logging.log4j.core.util.JsonUtilsTest
Running org.apache.logging.log4j.core.util.LoaderTest
Tests run: 2, Failures: 0, Errors: 0, Skipped: 0, Time elapsed: 0.064 sec - in org.apache.logging.log4j.core.util.LoaderTest
Running org.apache.logging.log4j.core.util.NetUtilsTest
Tests run: 3, Failures: 0, Errors: 0, Skipped: 0, Time elapsed: 0.063 sec - in org.apache.logging.log4j.core.util.NetUtilsTest
Running org.apache.logging.log4j.core.util.ShutdownCallbackRegistryTest
Tests run: 1, Failures: 0, Errors: 0, Skipped: 0, Time elapsed: 0.967 sec - in org.apache.logging.log4j.core.util.ShutdownCallbackRegistryTest
Running org.apache.logging.log4j.core.util.SystemClockTest
Tests run: 2, Failures: 0, Errors: 0, Skipped: 0, Time elapsed: 0.105 sec - in org.apache.logging.log4j.core.util.SystemClockTest
Running org.apache.logging.log4j.core.util.SystemNanoClockTest
Tests run: 1, Failures: 0, Errors: 0, Skipped: 0, Time elapsed: 0 sec - in org.apache.logging.log4j.core.util.SystemNanoClockTest
Running org.apache.logging.log4j.core.util.ThrowablesTest
Tests run: 6, Failures: 0, Errors: 0, Skipped: 0, Time elapsed: 0 sec - in org.apache.logging.log4j.core.util.ThrowablesTest
Running org.apache.logging.log4j.core.util.UuidTest
Elapsed for 2000 UUIDS = 2258591447 Average = 1129295 ns
Elapsed for 200 UUIDS = 86050 Average = 430 ns
Tests run: 2, Failures: 0, Errors: 0, Skipped: 0, Time elapsed: 0.28 sec - in org.apache.logging.log4j.core.util.UuidTest
Running org.apache.logging.log4j.core.util.WatchManagerTest
Tests run: 1, Failures: 0, Errors: 0, Skipped: 1, Time elapsed: 0.014 sec - in org.apache.logging.log4j.core.util.WatchManagerTest
Running org.apache.logging.log4j.MarkerMixInJsonTest
Tests run: 3, Failures: 0, Errors: 0, Skipped: 0, Time elapsed: 0.619 sec - in org.apache.logging.log4j.MarkerMixInJsonTest
Running org.apache.logging.log4j.MarkerMixInXmlTest
Tests run: 3, Failures: 0, Errors: 0, Skipped: 0, Time elapsed: 0.853 sec - in org.apache.logging.log4j.MarkerMixInXmlTest
Running org.apache.logging.log4j.MarkerMixInYamlTest
Tests run: 3, Failures: 0, Errors: 0, Skipped: 0, Time elapsed: 0.817 sec - in org.apache.logging.log4j.MarkerMixInYamlTest
Running org.apache.logging.log4j.message.MutableLogEventWithReusableParamMsgTest
Tests run: 1, Failures: 0, Errors: 0, Skipped: 0, Time elapsed: 0.029 sec - in org.apache.logging.log4j.message.MutableLogEventWithReusableParamMsgTest

Results :

Tests in error:
  SyslogAppenderCustomLayoutTest>SyslogAppenderTest.testTCPStructuredAppender:70->SyslogAppenderTest.initTCPTestEnvironment:100 » Bind
  SyslogAppenderTest.testTCPStructuredAppender:70->initTCPTestEnvironment:100 » Bind
  TlsSyslogAppenderTest.sendLargeLegacyBsdMessageOverTls:50->initTlsTestEnvironment:103 » Bind
  TlsSyslogAppenderTest>SyslogAppenderTest.testDefaultAppender:62->SyslogAppenderTest.initTCPTestEnvironment:100 » Bind
  TlsSyslogAppenderTest>SyslogAppenderTest.testTCPAppender:54->SyslogAppenderTest.initTCPTestEnvironment:100 » Bind
  TlsSyslogAppenderTest>SyslogAppenderTest.testTCPStructuredAppender:70->SyslogAppenderTest.initTCPTestEnvironment:100 » Bind

Tests run: 1856, Failures: 0, Errors: 6, Skipped: 17

[INFO] ------------------------------------------------------------------------
[INFO] Reactor Summary:
[INFO]
[INFO] Apache Log4j 2 ..................................... SUCCESS [  3.135 s]
[INFO] Apache Log4j API ................................... SUCCESS [ 24.503 s]
[INFO] Apache Log4j Core .................................. FAILURE [15:40 min]
[INFO] Apache Log4j Core Integration Tests ................ SKIPPED
[INFO] Apache Log4j 1.x Compatibility API ................. SKIPPED
[INFO] Apache Log4j SLF4J Binding ......................... SKIPPED
[INFO] Apache Log4j to SLF4J Adapter ...................... SKIPPED
[INFO] Apache Log4j Commons Logging Bridge ................ SKIPPED
[INFO] Apache Log4j Flume Bridge .......................... SKIPPED
[INFO] Apache Log4j Web ................................... SKIPPED
[INFO] Apache Log4j Tag Library ........................... SKIPPED
[INFO] Apache Log4j JMX GUI ............................... SKIPPED
[INFO] Apache Log4j Samples ............................... SKIPPED
[INFO] Apache Log4j Samples: Flume - Common ............... SKIPPED
[INFO] Apache Log4j Samples: Flume - Remote ............... SKIPPED
[INFO] Apache Log4j Samples: Flume - Embedded ............. SKIPPED
[INFO] Apache Log4j Samples: Configuration ................ SKIPPED
[INFO] Apache Log4j Samples: LoggerProperties ............. SKIPPED
[INFO] Apache Log4j Scala 2.11 wrapper for Log4j API ...... SKIPPED
[INFO] Apache Log4j Samples: Scala API .................... SKIPPED
[INFO] Apache Log4j OSGi .................................. SKIPPED
[INFO] Apache Log4j BOM ................................... SKIPPED
[INFO] Apache Log4j NoSQL ................................. SKIPPED
[INFO] Apache Log4J Performance Tests ..................... SKIPPED
[INFO] Apache Log4j Streaming Interface ................... SKIPPED
[INFO] Apache Log4j JUL Adapter ........................... SKIPPED
[INFO] Apache Log4j Liquibase Binding ..................... SKIPPED
[INFO] Apache Log4j Scala 2.10 wrapper for Log4j API ...... SKIPPED
[INFO] ------------------------------------------------------------------------
[INFO] BUILD FAILURE
[INFO] ------------------------------------------------------------------------
[INFO] Total time: 16:10 min
[INFO] Finished at: 2017-04-11T16:49:41+00:00
[INFO] Final Memory: 61M/1504M
[INFO] ------------------------------------------------------------------------
[ERROR] Failed to execute goal org.apache.maven.plugins:maven-surefire-plugin:2.19.1:test (default-test) on project log4j-core: There are test failures.
[ERROR]
[ERROR] Please refer to F:\jenkins\jenkins-slave\workspace\Log4jWindows\Windows Slaves\Windows\jdk\JDK 1.7 (unlimited security) 64-bit Windows only\log4j-core\target\surefire-reports for the individual test results.
[ERROR] -> [Help 1]
[ERROR]
[ERROR] To see the full stack trace of the errors, re-run Maven with the -e switch.
[ERROR] Re-run Maven using the -X switch to enable full debug logging.
[ERROR]
[ERROR] For more information about the errors and possible solutions, please read the following articles:
[ERROR] [Help 1] http://cwiki.apache.org/confluence/display/MAVEN/MojoFailureException
[ERROR]
[ERROR] After correcting the problems, you can resume the build with the command
[ERROR]   mvn <goals> -rf :log4j-core
Build step 'Execute Windows batch command' marked build as failure

---------------------------------------------------------------------
To unsubscribe, e-mail: [hidden email]
For additional commands, e-mail: [hidden email]

Reply | Threaded
Open this post in threaded view
|  
Report Content as Inappropriate

Build failed in Jenkins: Log4jWindows » Windows,JDK 1.7 (unlimited security) 64-bit Windows only #63

Apache Jenkins Server
See <https://builds.apache.org/job/Log4jWindows/Windows%20Slaves=Windows,jdk=JDK%201.7%20(unlimited%20security)%2064-bit%20Windows%20only/63/display/redirect?page=changes>

Changes:

[garydgregory] [LOG4J2-1879] Update JAnsi from 1.14 to 1.15.

------------------------------------------
[...truncated 375.16 KB...]
2017-04-12 00:15:17,542 main DEBUG PatternLayout$Builder(pattern="%m%n", PatternSelector=null, Configuration(PropertiesConfigTest), Replace=null, charset="null", alwaysWriteExceptions="null", disableAnsi="null", noConsoleNoAnsi="null", header="null", footer="null")
2017-04-12 00:15:17,543 main DEBUG Building Plugin[name=appender, class=org.apache.logging.log4j.core.appender.ConsoleAppender].
2017-04-12 00:15:17,546 main DEBUG ConsoleAppender$Builder(target="null", follow="null", direct="null", bufferedIo="null", bufferSize="null", immediateFlush="null", ignoreExceptions="null", PatternLayout(%m%n), name="STDOUT", Configuration(PropertiesConfigTest), Filter=null)
2017-04-12 00:15:17,546 main WARN Unable to instantiate org.fusesource.jansi.WindowsAnsiOutputStream
2017-04-12 00:15:17,547 main DEBUG Starting OutputStreamManager SYSTEM_OUT.false.false
2017-04-12 00:15:17,547 main DEBUG Building Plugin[name=appenders, class=org.apache.logging.log4j.core.config.AppendersPlugin].
2017-04-12 00:15:17,548 main DEBUG createAppenders(={File, List, STDOUT})
2017-04-12 00:15:17,548 main DEBUG Building Plugin[name=filter, class=org.apache.logging.log4j.core.filter.ThresholdFilter].
2017-04-12 00:15:17,549 main DEBUG createFilter(level="DEBUG", onMatch="null", onMismatch="null")
2017-04-12 00:15:17,551 main DEBUG Configuration org.apache.logging.log4j.core.config.properties.PropertiesConfiguration@14ff89d7 initialized
2017-04-12 00:15:17,551 main DEBUG Starting configuration org.apache.logging.log4j.core.config.properties.PropertiesConfiguration@14ff89d7
2017-04-12 00:15:17,552 main DEBUG Log4j2 ConfigurationScheduler starting 1 threads
2017-04-12 00:15:17,553 main DEBUG Started configuration org.apache.logging.log4j.core.config.properties.PropertiesConfiguration@14ff89d7 OK.
2017-04-12 00:15:17,554 main DEBUG Shutting down OutputStreamManager SYSTEM_OUT.false.false-1
2017-04-12 00:15:17,555 main DEBUG Shut down OutputStreamManager SYSTEM_OUT.false.false-1, all resources released: true
2017-04-12 00:15:17,555 main DEBUG Appender DefaultConsole-1 stopped with status true
2017-04-12 00:15:17,555 main DEBUG Stopped org.apache.logging.log4j.core.config.DefaultConfiguration@52052438 OK
2017-04-12 00:15:17,662 main DEBUG Registering MBean org.apache.logging.log4j2:type=org.apache.logging.log4j.core.PropertiesFileConfigTest
2017-04-12 00:15:17,667 main DEBUG Registering MBean org.apache.logging.log4j2:type=org.apache.logging.log4j.core.PropertiesFileConfigTest,component=StatusLogger
2017-04-12 00:15:17,670 main DEBUG Registering MBean org.apache.logging.log4j2:type=org.apache.logging.log4j.core.PropertiesFileConfigTest,component=ContextSelector
2017-04-12 00:15:17,673 main DEBUG Registering MBean org.apache.logging.log4j2:type=org.apache.logging.log4j.core.PropertiesFileConfigTest,component=Loggers,name=org.apache.logging.log4j.test2
2017-04-12 00:15:17,674 main DEBUG Registering MBean org.apache.logging.log4j2:type=org.apache.logging.log4j.core.PropertiesFileConfigTest,component=Loggers,name=
2017-04-12 00:15:17,675 main DEBUG Registering MBean org.apache.logging.log4j2:type=org.apache.logging.log4j.core.PropertiesFileConfigTest,component=Loggers,name=org.apache.logging.log4j.test1
2017-04-12 00:15:17,677 main DEBUG Registering MBean org.apache.logging.log4j2:type=org.apache.logging.log4j.core.PropertiesFileConfigTest,component=Appenders,name=List
2017-04-12 00:15:17,678 main DEBUG Registering MBean org.apache.logging.log4j2:type=org.apache.logging.log4j.core.PropertiesFileConfigTest,component=Appenders,name=STDOUT
2017-04-12 00:15:17,678 main DEBUG Registering MBean org.apache.logging.log4j2:type=org.apache.logging.log4j.core.PropertiesFileConfigTest,component=Appenders,name=File
2017-04-12 00:15:17,682 main DEBUG LoggerContext[name=org.apache.logging.log4j.core.PropertiesFileConfigTest, org.apache.logging.log4j.core.LoggerContext@57052dc3] started OK with configuration org.apache.logging.log4j.core.config.properties.PropertiesConfiguration@14ff89d7.
Running org.apache.logging.log4j.core.PropertiesFileConfigTest
2017-04-12 00:15:18,554 Log4j2-TF-2-Scheduled-1 INFO File target\test-classes\log4j-test2.properties was modified on 1491955249678, previous modification was 1491955239678
2017-04-12 00:15:18,557 Log4j2-TF-1-ConfiguratonFileWatcher-2 DEBUG Reconfiguration started for context org.apache.logging.log4j.core.PropertiesFileConfigTest (org.apache.logging.log4j.core.LoggerContext@57052dc3)
2017-04-12 00:15:18,559 Log4j2-TF-1-ConfiguratonFileWatcher-2 DEBUG Not in a ServletContext environment, thus not loading WebLookup plugin.
2017-04-12 00:15:18,562 Log4j2-TF-1-ConfiguratonFileWatcher-2 DEBUG Not in a ServletContext environment, thus not loading WebLookup plugin.
2017-04-12 00:15:18,563 Log4j2-TF-1-ConfiguratonFileWatcher-2 DEBUG Initializing configuration org.apache.logging.log4j.core.config.properties.PropertiesConfiguration@74242ba3
2017-04-12 00:15:18,565 Log4j2-TF-1-ConfiguratonFileWatcher-2 DEBUG Installed script engines
2017-04-12 00:15:18,566 Log4j2-TF-1-ConfiguratonFileWatcher-2 DEBUG Mozilla Rhino Version: 1.7 release 3 PRERELEASE, Language: ECMAScript, Threading: MULTITHREADED, Compile: true, Names: {js, rhino, JavaScript, javascript, ECMAScript, ecmascript}
2017-04-12 00:15:18,580 Log4j2-TF-1-ConfiguratonFileWatcher-2 DEBUG BeanShell Engine Version: 1.0, Language: BeanShell, Threading: MULTITHREADED, Compile: true, Names: {beanshell, bsh, java}
2017-04-12 00:15:18,580 Log4j2-TF-1-ConfiguratonFileWatcher-2 DEBUG Groovy Scripting Engine Version: 2.0, Language: Groovy, Threading: MULTITHREADED, Compile: true, Names: {groovy, Groovy}
2017-04-12 00:15:18,581 Log4j2-TF-1-ConfiguratonFileWatcher-2 DEBUG PluginManager 'Core' found 122 plugins
2017-04-12 00:15:18,581 Log4j2-TF-1-ConfiguratonFileWatcher-2 DEBUG PluginManager 'Level' found 1 plugins
2017-04-12 00:15:18,581 Log4j2-TF-1-ConfiguratonFileWatcher-2 DEBUG Building Plugin[name=property, class=org.apache.logging.log4j.core.config.Property].
2017-04-12 00:15:18,582 Log4j2-TF-1-ConfiguratonFileWatcher-2 DEBUG createProperty(name="filename", value="target/test-properties.log")
2017-04-12 00:15:18,582 Log4j2-TF-1-ConfiguratonFileWatcher-2 DEBUG Building Plugin[name=properties, class=org.apache.logging.log4j.core.config.PropertiesPlugin].
2017-04-12 00:15:18,583 Log4j2-TF-1-ConfiguratonFileWatcher-2 DEBUG configureSubstitutor(={filename=target/test-properties.log}, Configuration(PropertiesConfigTest))
2017-04-12 00:15:18,583 Log4j2-TF-1-ConfiguratonFileWatcher-2 DEBUG PluginManager 'Lookup' found 13 plugins
2017-04-12 00:15:18,584 Log4j2-TF-1-ConfiguratonFileWatcher-2 DEBUG Building Plugin[name=AppenderRef, class=org.apache.logging.log4j.core.config.AppenderRef].
2017-04-12 00:15:18,585 Log4j2-TF-1-ConfiguratonFileWatcher-2 DEBUG createAppenderRef(ref="File", level="null", Filter=null)
2017-04-12 00:15:18,585 Log4j2-TF-1-ConfiguratonFileWatcher-2 DEBUG Building Plugin[name=logger, class=org.apache.logging.log4j.core.config.LoggerConfig].
2017-04-12 00:15:18,587 Log4j2-TF-1-ConfiguratonFileWatcher-2 DEBUG createLogger(additivity="false", level="DEBUG", name="org.apache.logging.log4j.test2", includeLocation="null", ={File}, ={}, Configuration(PropertiesConfigTest), Filter=null)
2017-04-12 00:15:18,587 Log4j2-TF-1-ConfiguratonFileWatcher-2 DEBUG Building Plugin[name=AppenderRef, class=org.apache.logging.log4j.core.config.AppenderRef].
2017-04-12 00:15:18,588 Log4j2-TF-1-ConfiguratonFileWatcher-2 DEBUG createAppenderRef(ref="STDOUT", level="null", Filter=null)
2017-04-12 00:15:18,588 Log4j2-TF-1-ConfiguratonFileWatcher-2 DEBUG Building Plugin[name=KeyValuePair, class=org.apache.logging.log4j.core.util.KeyValuePair].
2017-04-12 00:15:18,589 Log4j2-TF-1-ConfiguratonFileWatcher-2 DEBUG KeyValuePair$Builder(key="test", value="123")
2017-04-12 00:15:18,589 Log4j2-TF-1-ConfiguratonFileWatcher-2 DEBUG Building Plugin[name=filter, class=org.apache.logging.log4j.core.filter.ThreadContextMapFilter].
2017-04-12 00:15:18,590 Log4j2-TF-1-ConfiguratonFileWatcher-2 DEBUG createFilter(={test=123}, operator="null", onMatch="null", onMismatch="null")
2017-04-12 00:15:18,590 Log4j2-TF-1-ConfiguratonFileWatcher-2 DEBUG Building Plugin[name=logger, class=org.apache.logging.log4j.core.config.LoggerConfig].
2017-04-12 00:15:18,592 Log4j2-TF-1-ConfiguratonFileWatcher-2 DEBUG createLogger(additivity="false", level="DEBUG", name="org.apache.logging.log4j.test1", includeLocation="null", ={STDOUT}, ={}, Configuration(PropertiesConfigTest), ThreadContextMapFilter(isAnd=true, {test=[123]}))
2017-04-12 00:15:18,592 Log4j2-TF-1-ConfiguratonFileWatcher-2 DEBUG Building Plugin[name=AppenderRef, class=org.apache.logging.log4j.core.config.AppenderRef].
2017-04-12 00:15:18,593 Log4j2-TF-1-ConfiguratonFileWatcher-2 DEBUG createAppenderRef(ref="STDOUT", level="null", Filter=null)
2017-04-12 00:15:18,593 Log4j2-TF-1-ConfiguratonFileWatcher-2 DEBUG Building Plugin[name=root, class=org.apache.logging.log4j.core.config.LoggerConfig$RootLogger].
2017-04-12 00:15:18,595 Log4j2-TF-1-ConfiguratonFileWatcher-2 DEBUG createLogger(additivity="null", level="ERROR", includeLocation="null", ={STDOUT}, ={}, Configuration(PropertiesConfigTest), Filter=null)
2017-04-12 00:15:18,595 Log4j2-TF-1-ConfiguratonFileWatcher-2 DEBUG Building Plugin[name=loggers, class=org.apache.logging.log4j.core.config.LoggersPlugin].
2017-04-12 00:15:18,596 Log4j2-TF-1-ConfiguratonFileWatcher-2 DEBUG createLoggers(={org.apache.logging.log4j.test2, org.apache.logging.log4j.test1, root})
2017-04-12 00:15:18,596 Log4j2-TF-1-ConfiguratonFileWatcher-2 DEBUG Building Plugin[name=layout, class=org.apache.logging.log4j.core.layout.PatternLayout].
2017-04-12 00:15:18,598 Log4j2-TF-1-ConfiguratonFileWatcher-2 DEBUG PatternLayout$Builder(pattern="%d %p %C{1.} [%t] %m%n", PatternSelector=null, Configuration(PropertiesConfigTest), Replace=null, charset="null", alwaysWriteExceptions="null", disableAnsi="null", noConsoleNoAnsi="null", header="null", footer="null")
2017-04-12 00:15:18,598 Log4j2-TF-1-ConfiguratonFileWatcher-2 DEBUG PluginManager 'Converter' found 41 plugins
2017-04-12 00:15:18,599 Log4j2-TF-1-ConfiguratonFileWatcher-2 DEBUG Building Plugin[name=appender, class=org.apache.logging.log4j.core.appender.FileAppender].
2017-04-12 00:15:18,601 Log4j2-TF-1-ConfiguratonFileWatcher-2 DEBUG FileAppender$Builder(fileName="target/test-properties.log", append="null", locking="null", advertise="null", advertiseUri="null", createOnDemand="null", bufferedIo="false", bufferSize="null", immediateFlush="null", ignoreExceptions="null", PatternLayout(%d %p %C{1.} [%t] %m%n), name="File", Configuration(PropertiesConfigTest), Filter=null)
2017-04-12 00:15:18,601 Log4j2-TF-1-ConfiguratonFileWatcher-2 WARN The bufferSize is set to 8192 but bufferedIo is false: false
2017-04-12 00:15:18,602 Log4j2-TF-1-ConfiguratonFileWatcher-2 DEBUG Building Plugin[name=filter, class=org.apache.logging.log4j.core.filter.ThresholdFilter].
2017-04-12 00:15:18,603 Log4j2-TF-1-ConfiguratonFileWatcher-2 DEBUG createFilter(level="ERROR", onMatch="null", onMismatch="null")
2017-04-12 00:15:18,603 Log4j2-TF-1-ConfiguratonFileWatcher-2 DEBUG Building Plugin[name=appender, class=org.apache.logging.log4j.test.appender.ListAppender].
2017-04-12 00:15:18,604 Log4j2-TF-1-ConfiguratonFileWatcher-2 DEBUG ListAppender$Builder(name="List", entryPerNewLine="null", raw="null", Layout=null, ThresholdFilter(ERROR))
2017-04-12 00:15:18,604 Log4j2-TF-1-ConfiguratonFileWatcher-2 DEBUG Building Plugin[name=layout, class=org.apache.logging.log4j.core.layout.PatternLayout].
2017-04-12 00:15:18,606 Log4j2-TF-1-ConfiguratonFileWatcher-2 DEBUG PatternLayout$Builder(pattern="%m%n", PatternSelector=null, Configuration(PropertiesConfigTest), Replace=null, charset="null", alwaysWriteExceptions="null", disableAnsi="null", noConsoleNoAnsi="null", header="null", footer="null")
2017-04-12 00:15:18,607 Log4j2-TF-1-ConfiguratonFileWatcher-2 DEBUG Building Plugin[name=appender, class=org.apache.logging.log4j.core.appender.ConsoleAppender].
2017-04-12 00:15:18,610 Log4j2-TF-1-ConfiguratonFileWatcher-2 DEBUG ConsoleAppender$Builder(target="null", follow="null", direct="null", bufferedIo="null", bufferSize="null", immediateFlush="null", ignoreExceptions="null", PatternLayout(%m%n), name="STDOUT", Configuration(PropertiesConfigTest), Filter=null)
2017-04-12 00:15:18,610 Log4j2-TF-1-ConfiguratonFileWatcher-2 WARN Unable to instantiate org.fusesource.jansi.WindowsAnsiOutputStream
2017-04-12 00:15:18,611 Log4j2-TF-1-ConfiguratonFileWatcher-2 DEBUG Building Plugin[name=appenders, class=org.apache.logging.log4j.core.config.AppendersPlugin].
2017-04-12 00:15:18,611 Log4j2-TF-1-ConfiguratonFileWatcher-2 DEBUG createAppenders(={File, List, STDOUT})
2017-04-12 00:15:18,611 Log4j2-TF-1-ConfiguratonFileWatcher-2 DEBUG Building Plugin[name=filter, class=org.apache.logging.log4j.core.filter.ThresholdFilter].
2017-04-12 00:15:18,612 Log4j2-TF-1-ConfiguratonFileWatcher-2 DEBUG createFilter(level="DEBUG", onMatch="null", onMismatch="null")
2017-04-12 00:15:18,613 Log4j2-TF-1-ConfiguratonFileWatcher-2 DEBUG Configuration org.apache.logging.log4j.core.config.properties.PropertiesConfiguration@74242ba3 initialized
2017-04-12 00:15:18,613 Log4j2-TF-1-ConfiguratonFileWatcher-2 DEBUG Starting configuration org.apache.logging.log4j.core.config.properties.PropertiesConfiguration@74242ba3
2017-04-12 00:15:18,613 Log4j2-TF-1-ConfiguratonFileWatcher-2 DEBUG Log4j2 ConfigurationScheduler starting 1 threads
2017-04-12 00:15:18,614 Log4j2-TF-1-ConfiguratonFileWatcher-2 DEBUG Started configuration org.apache.logging.log4j.core.config.properties.PropertiesConfiguration@74242ba3 OK.
2017-04-12 00:15:18,614 Log4j2-TF-1-ConfiguratonFileWatcher-2 DEBUG Appender File stopped with status true
2017-04-12 00:15:18,614 Log4j2-TF-1-ConfiguratonFileWatcher-2 DEBUG Appender STDOUT stopped with status true
2017-04-12 00:15:18,615 Log4j2-TF-1-ConfiguratonFileWatcher-2 DEBUG Log4j2 ConfigurationScheduler shutting down threads in java.util.concurrent.ScheduledThreadPoolExecutor@47d6c372[Running, pool size = 1, active threads = 0, queued tasks = 1, completed tasks = 1]
2017-04-12 00:15:18,615 Log4j2-TF-1-ConfiguratonFileWatcher-2 DEBUG Stopped org.apache.logging.log4j.core.config.properties.PropertiesConfiguration@14ff89d7 OK
2017-04-12 00:15:18,617 Log4j2-TF-1-ConfiguratonFileWatcher-2 DEBUG Registering MBean org.apache.logging.log4j2:type=org.apache.logging.log4j.core.PropertiesFileConfigTest
2017-04-12 00:15:18,618 Log4j2-TF-1-ConfiguratonFileWatcher-2 DEBUG Registering MBean org.apache.logging.log4j2:type=org.apache.logging.log4j.core.PropertiesFileConfigTest,component=StatusLogger
2017-04-12 00:15:18,618 Log4j2-TF-1-ConfiguratonFileWatcher-2 DEBUG Registering MBean org.apache.logging.log4j2:type=org.apache.logging.log4j.core.PropertiesFileConfigTest,component=ContextSelector
2017-04-12 00:15:18,619 Log4j2-TF-1-ConfiguratonFileWatcher-2 DEBUG Registering MBean org.apache.logging.log4j2:type=org.apache.logging.log4j.core.PropertiesFileConfigTest,component=Loggers,name=org.apache.logging.log4j.test2
2017-04-12 00:15:18,619 Log4j2-TF-1-ConfiguratonFileWatcher-2 DEBUG Registering MBean org.apache.logging.log4j2:type=org.apache.logging.log4j.core.PropertiesFileConfigTest,component=Loggers,name=
2017-04-12 00:15:18,620 Log4j2-TF-1-ConfiguratonFileWatcher-2 DEBUG Registering MBean org.apache.logging.log4j2:type=org.apache.logging.log4j.core.PropertiesFileConfigTest,component=Loggers,name=org.apache.logging.log4j.test1
2017-04-12 00:15:18,620 Log4j2-TF-1-ConfiguratonFileWatcher-2 DEBUG Registering MBean org.apache.logging.log4j2:type=org.apache.logging.log4j.core.PropertiesFileConfigTest,component=Appenders,name=List
2017-04-12 00:15:18,621 Log4j2-TF-1-ConfiguratonFileWatcher-2 DEBUG Registering MBean org.apache.logging.log4j2:type=org.apache.logging.log4j.core.PropertiesFileConfigTest,component=Appenders,name=STDOUT
2017-04-12 00:15:18,621 Log4j2-TF-1-ConfiguratonFileWatcher-2 DEBUG Registering MBean org.apache.logging.log4j2:type=org.apache.logging.log4j.core.PropertiesFileConfigTest,component=Appenders,name=File
2017-04-12 00:15:18,621 Log4j2-TF-1-ConfiguratonFileWatcher-2 DEBUG Reconfiguration completed for org.apache.logging.log4j.core.PropertiesFileConfigTest (org.apache.logging.log4j.core.LoggerContext@57052dc3)
2017-04-12 00:15:23,795 main DEBUG Stopping LoggerContext[name=org.apache.logging.log4j.core.PropertiesFileConfigTest, org.apache.logging.log4j.core.LoggerContext@57052dc3]...
2017-04-12 00:15:23,797 main DEBUG Shutting down FileManager target/test-properties.log
2017-04-12 00:15:23,798 main DEBUG Shut down FileManager target/test-properties.log, all resources released: true
2017-04-12 00:15:23,798 main DEBUG Appender File stopped with status true
2017-04-12 00:15:23,798 main DEBUG Shutting down OutputStreamManager SYSTEM_OUT.false.false
2017-04-12 00:15:23,798 main DEBUG Shut down OutputStreamManager SYSTEM_OUT.false.false, all resources released: true
2017-04-12 00:15:23,799 main DEBUG Appender STDOUT stopped with status true
2017-04-12 00:15:23,799 main DEBUG Log4j2 ConfigurationScheduler shutting down threads in java.util.concurrent.ScheduledThreadPoolExecutor@2d653029[Running, pool size = 1, active threads = 0, queued tasks = 1, completed tasks = 5]
2017-04-12 00:15:23,799 main DEBUG Stopped org.apache.logging.log4j.core.config.properties.PropertiesConfiguration@74242ba3 OK
2017-04-12 00:15:23,800 main DEBUG Stopped LoggerContext[name=org.apache.logging.log4j.core.PropertiesFileConfigTest, org.apache.logging.log4j.core.LoggerContext@57052dc3] with status true
Tests run: 1, Failures: 0, Errors: 0, Skipped: 0, Time elapsed: 6.111 sec - in org.apache.logging.log4j.core.PropertiesFileConfigTest
Running org.apache.logging.log4j.core.selector.ClassLoaderContextSelectorTest
ERROR StatusLogger No log4j2 configuration file found. Using default configuration: logging only errors to the console. Set system property 'org.apache.logging.log4j.simplelog.StatusLogger.level' to TRACE to show Log4j2 internal initialization logging.
Tests run: 1, Failures: 0, Errors: 0, Skipped: 0, Time elapsed: 0.897 sec - in org.apache.logging.log4j.core.selector.ClassLoaderContextSelectorTest
Running org.apache.logging.log4j.core.ShutdownDisabledTest
Tests run: 1, Failures: 0, Errors: 0, Skipped: 0, Time elapsed: 0.006 sec - in org.apache.logging.log4j.core.ShutdownDisabledTest
Running org.apache.logging.log4j.core.ShutdownTimeoutConfigurationTest
Tests run: 1, Failures: 0, Errors: 0, Skipped: 0, Time elapsed: 0.005 sec - in org.apache.logging.log4j.core.ShutdownTimeoutConfigurationTest
Running org.apache.logging.log4j.core.StrictXmlConfigTest
Tests run: 10, Failures: 0, Errors: 0, Skipped: 0, Time elapsed: 0.062 sec - in org.apache.logging.log4j.core.StrictXmlConfigTest
Running org.apache.logging.log4j.core.TimestampMessageTest
Tests run: 1, Failures: 0, Errors: 0, Skipped: 0, Time elapsed: 0.04 sec - in org.apache.logging.log4j.core.TimestampMessageTest
Running org.apache.logging.log4j.core.tools.GenerateCustomLoggerTest
Tests run: 1, Failures: 0, Errors: 0, Skipped: 0, Time elapsed: 1.823 sec - in org.apache.logging.log4j.core.tools.GenerateCustomLoggerTest
Running org.apache.logging.log4j.core.tools.GenerateExtendedLoggerTest
Tests run: 1, Failures: 0, Errors: 0, Skipped: 0, Time elapsed: 1.956 sec - in org.apache.logging.log4j.core.tools.GenerateExtendedLoggerTest
Running org.apache.logging.log4j.core.util.AssertTest
Tests run: 13, Failures: 0, Errors: 0, Skipped: 0, Time elapsed: 0.006 sec - in org.apache.logging.log4j.core.util.AssertTest
Running org.apache.logging.log4j.core.util.ClockFactoryTest
Tests run: 8, Failures: 0, Errors: 0, Skipped: 0, Time elapsed: 0.156 sec - in org.apache.logging.log4j.core.util.ClockFactoryTest
Running org.apache.logging.log4j.core.util.CronExpressionTest
Tests run: 12, Failures: 0, Errors: 0, Skipped: 0, Time elapsed: 0.704 sec - in org.apache.logging.log4j.core.util.CronExpressionTest
Running org.apache.logging.log4j.core.util.datetime.FastDateParserSDFTest
Tests run: 276, Failures: 0, Errors: 0, Skipped: 0, Time elapsed: 0.228 sec - in org.apache.logging.log4j.core.util.datetime.FastDateParserSDFTest
Running org.apache.logging.log4j.core.util.datetime.FastDateParserTest
Tests run: 37, Failures: 0, Errors: 0, Skipped: 0, Time elapsed: 2.03 sec - in org.apache.logging.log4j.core.util.datetime.FastDateParserTest
Running org.apache.logging.log4j.core.util.datetime.FastDateParser_MoreOrLessTest
Tests run: 7, Failures: 0, Errors: 0, Skipped: 0, Time elapsed: 0.11 sec - in org.apache.logging.log4j.core.util.datetime.FastDateParser_MoreOrLessTest
Running org.apache.logging.log4j.core.util.datetime.FastDateParser_TimeZoneStrategyTest
Tests run: 2, Failures: 0, Errors: 0, Skipped: 0, Time elapsed: 3.55 sec - in org.apache.logging.log4j.core.util.datetime.FastDateParser_TimeZoneStrategyTest
Running org.apache.logging.log4j.core.util.datetime.FixedDateFormatTest
Tests run: 25, Failures: 0, Errors: 0, Skipped: 0, Time elapsed: 1.608 sec - in org.apache.logging.log4j.core.util.datetime.FixedDateFormatTest
Running org.apache.logging.log4j.core.util.DummyNanoClockTest
Tests run: 2, Failures: 0, Errors: 0, Skipped: 0, Time elapsed: 0.005 sec - in org.apache.logging.log4j.core.util.DummyNanoClockTest
Running org.apache.logging.log4j.core.util.FileUtilsTest
Tests run: 4, Failures: 0, Errors: 0, Skipped: 0, Time elapsed: 0.065 sec - in org.apache.logging.log4j.core.util.FileUtilsTest
Running org.apache.logging.log4j.core.util.IntegersTest
Tests run: 2, Failures: 0, Errors: 0, Skipped: 0, Time elapsed: 0.005 sec - in org.apache.logging.log4j.core.util.IntegersTest
Running org.apache.logging.log4j.core.util.JsonUtilsTest
Tests run: 3, Failures: 0, Errors: 0, Skipped: 0, Time elapsed: 0.005 sec - in org.apache.logging.log4j.core.util.JsonUtilsTest
Running org.apache.logging.log4j.core.util.LoaderTest
Tests run: 2, Failures: 0, Errors: 0, Skipped: 0, Time elapsed: 0.06 sec - in org.apache.logging.log4j.core.util.LoaderTest
Running org.apache.logging.log4j.core.util.NetUtilsTest
Tests run: 3, Failures: 0, Errors: 0, Skipped: 0, Time elapsed: 0.059 sec - in org.apache.logging.log4j.core.util.NetUtilsTest
Running org.apache.logging.log4j.core.util.ShutdownCallbackRegistryTest
Tests run: 1, Failures: 0, Errors: 0, Skipped: 0, Time elapsed: 0.999 sec - in org.apache.logging.log4j.core.util.ShutdownCallbackRegistryTest
Running org.apache.logging.log4j.core.util.SystemClockTest
Tests run: 2, Failures: 0, Errors: 0, Skipped: 0, Time elapsed: 0.106 sec - in org.apache.logging.log4j.core.util.SystemClockTest
Running org.apache.logging.log4j.core.util.SystemNanoClockTest
Tests run: 1, Failures: 0, Errors: 0, Skipped: 0, Time elapsed: 0.004 sec - in org.apache.logging.log4j.core.util.SystemNanoClockTest
Running org.apache.logging.log4j.core.util.ThrowablesTest
Tests run: 6, Failures: 0, Errors: 0, Skipped: 0, Time elapsed: 0.007 sec - in org.apache.logging.log4j.core.util.ThrowablesTest
Running org.apache.logging.log4j.core.util.UuidTest
Elapsed for 2000 UUIDS = 2123618949 Average = 1061809 ns
Elapsed for 200 UUIDS = 96231 Average = 481 ns
Tests run: 2, Failures: 0, Errors: 0, Skipped: 0, Time elapsed: 0.241 sec - in org.apache.logging.log4j.core.util.UuidTest
Running org.apache.logging.log4j.core.util.WatchManagerTest
Tests run: 1, Failures: 0, Errors: 0, Skipped: 1, Time elapsed: 0.015 sec - in org.apache.logging.log4j.core.util.WatchManagerTest
Running org.apache.logging.log4j.MarkerMixInJsonTest
Tests run: 3, Failures: 0, Errors: 0, Skipped: 0, Time elapsed: 0.604 sec - in org.apache.logging.log4j.MarkerMixInJsonTest
Running org.apache.logging.log4j.MarkerMixInXmlTest
Tests run: 3, Failures: 0, Errors: 0, Skipped: 0, Time elapsed: 0.818 sec - in org.apache.logging.log4j.MarkerMixInXmlTest
Running org.apache.logging.log4j.MarkerMixInYamlTest
Tests run: 3, Failures: 0, Errors: 0, Skipped: 0, Time elapsed: 0.705 sec - in org.apache.logging.log4j.MarkerMixInYamlTest
Running org.apache.logging.log4j.message.MutableLogEventWithReusableParamMsgTest
Tests run: 1, Failures: 0, Errors: 0, Skipped: 0, Time elapsed: 0.039 sec - in org.apache.logging.log4j.message.MutableLogEventWithReusableParamMsgTest

Results :

Failed tests:
  SyslogAppenderTest.testUDPAppender:79->SyslogAppenderTestBase.sendAndCheckLegacyBsdMessage:72->SyslogAppenderTestBase.checkTheNumberOfSentAndReceivedMessages:110 The number of received messages should be equal with the number of sent messages expected:<1> but was:<0>
Tests in error:
org.apache.logging.log4j.core.appender.SyslogAppenderCustomLayoutTest.testDefaultAppender(org.apache.logging.log4j.core.appender.SyslogAppenderCustomLayoutTest)
  Run 1: SyslogAppenderCustomLayoutTest>SyslogAppenderTest.testDefaultAppender:64->SyslogAppenderTestBase.sendAndCheckLegacyBsdMessage:72->SyslogAppenderTestBase.checkTheNumberOfSentAndReceivedMessages:110 The number of received messages should be equal with the number of sent messages expected:<1> but was:<0>
  Run 2: SyslogAppenderCustomLayoutTest>SyslogAppenderTest.teardown:48 » NullPointer

  SyslogAppenderCustomLayoutTest>SyslogAppenderTest.testUDPAppender:77->SyslogAppenderTest.initUDPTestEnvironment:94 » Bind
org.apache.logging.log4j.core.appender.SyslogAppenderCustomLayoutTest.testUDPStructuredAppender(org.apache.logging.log4j.core.appender.SyslogAppenderCustomLayoutTest)
  Run 1: SyslogAppenderCustomLayoutTest>SyslogAppenderTest.testUDPStructuredAppender:88->SyslogAppenderTestBase.sendAndCheckStructuredMessage:91->SyslogAppenderTestBase.checkTheNumberOfSentAndReceivedMessages:110 The number of received messages should be equal with the number of sent messages expected:<1> but was:<0>
  Run 2: SyslogAppenderCustomLayoutTest>SyslogAppenderTest.teardown:48 » NullPointer

org.apache.logging.log4j.core.appender.SyslogAppenderTest.testTCPStructuredAppender(org.apache.logging.log4j.core.appender.SyslogAppenderTest)
  Run 1: SyslogAppenderTest.testTCPStructuredAppender:72->SyslogAppenderTestBase.sendAndCheckStructuredMessage:91->SyslogAppenderTestBase.checkTheNumberOfSentAndReceivedMessages:110 The number of received messages should be equal with the number of sent messages expected:<1> but was:<0>
  Run 2: SyslogAppenderTest.teardown:48 » NullPointer


Tests run: 1856, Failures: 1, Errors: 4, Skipped: 17

[INFO] ------------------------------------------------------------------------
[INFO] Reactor Summary:
[INFO]
[INFO] Apache Log4j 2 ..................................... SUCCESS [  2.737 s]
[INFO] Apache Log4j API ................................... SUCCESS [ 20.181 s]
[INFO] Apache Log4j Core .................................. FAILURE [16:03 min]
[INFO] Apache Log4j Core Integration Tests ................ SKIPPED
[INFO] Apache Log4j 1.x Compatibility API ................. SKIPPED
[INFO] Apache Log4j SLF4J Binding ......................... SKIPPED
[INFO] Apache Log4j to SLF4J Adapter ...................... SKIPPED
[INFO] Apache Log4j Commons Logging Bridge ................ SKIPPED
[INFO] Apache Log4j Flume Bridge .......................... SKIPPED
[INFO] Apache Log4j Web ................................... SKIPPED
[INFO] Apache Log4j Tag Library ........................... SKIPPED
[INFO] Apache Log4j JMX GUI ............................... SKIPPED
[INFO] Apache Log4j Samples ............................... SKIPPED
[INFO] Apache Log4j Samples: Flume - Common ............... SKIPPED
[INFO] Apache Log4j Samples: Flume - Remote ............... SKIPPED
[INFO] Apache Log4j Samples: Flume - Embedded ............. SKIPPED
[INFO] Apache Log4j Samples: Configuration ................ SKIPPED
[INFO] Apache Log4j Samples: LoggerProperties ............. SKIPPED
[INFO] Apache Log4j Scala 2.11 wrapper for Log4j API ...... SKIPPED
[INFO] Apache Log4j Samples: Scala API .................... SKIPPED
[INFO] Apache Log4j OSGi .................................. SKIPPED
[INFO] Apache Log4j BOM ................................... SKIPPED
[INFO] Apache Log4j NoSQL ................................. SKIPPED
[INFO] Apache Log4J Performance Tests ..................... SKIPPED
[INFO] Apache Log4j Streaming Interface ................... SKIPPED
[INFO] Apache Log4j JUL Adapter ........................... SKIPPED
[INFO] Apache Log4j Liquibase Binding ..................... SKIPPED
[INFO] Apache Log4j Scala 2.10 wrapper for Log4j API ...... SKIPPED
[INFO] ------------------------------------------------------------------------
[INFO] BUILD FAILURE
[INFO] ------------------------------------------------------------------------
[INFO] Total time: 16:28 min
[INFO] Finished at: 2017-04-12T00:16:16+00:00
[INFO] Final Memory: 61M/1502M
[INFO] ------------------------------------------------------------------------
[ERROR] Failed to execute goal org.apache.maven.plugins:maven-surefire-plugin:2.19.1:test (default-test) on project log4j-core: There are test failures.
[ERROR]
[ERROR] Please refer to F:\jenkins\jenkins-slave\workspace\Log4jWindows\Windows Slaves\Windows\jdk\JDK 1.7 (unlimited security) 64-bit Windows only\log4j-core\target\surefire-reports for the individual test results.
[ERROR] -> [Help 1]
[ERROR]
[ERROR] To see the full stack trace of the errors, re-run Maven with the -e switch.
[ERROR] Re-run Maven using the -X switch to enable full debug logging.
[ERROR]
[ERROR] For more information about the errors and possible solutions, please read the following articles:
[ERROR] [Help 1] http://cwiki.apache.org/confluence/display/MAVEN/MojoFailureException
[ERROR]
[ERROR] After correcting the problems, you can resume the build with the command
[ERROR]   mvn <goals> -rf :log4j-core
Build step 'Execute Windows batch command' marked build as failure

---------------------------------------------------------------------
To unsubscribe, e-mail: [hidden email]
For additional commands, e-mail: [hidden email]

Loading...